{"text_format":"1","workbook":"xlsx","n_sheets":13,"sheets":["ISS","Hoja2","TABLA","INFORMACION ","HONORARIOS ","DERECHO DE SALA ","INSUMOS MEDICOS","MATERIALES","Facturacion ","Facturacion Multiple","Hoja1","Hoja4","Hoja3"],"not_rendered":{"charts":0,"images":0,"macros":1,"external_links":1,"defined_names":6,"comments":1,"pivot_tables":0},"unopened":[],"bounds":{"document_bytes":16777216,"sheet_cells":100000,"rows_first":2000,"rows_last":500,"rows_between":2000,"halvings":0,"cell_chars":16384,"cell_head_chars":4096},"cells_cut":0,"cells_raw":0,"read":"whole","date_system":"1900"}

{"sheet":"ISS","index":0,"n_rows":1021,"n_cols":3,"rows_kept":1021,"cut":false,"hidden":false,"merged":[]}
["CODIGO","PROCEDIMIENTO","UVR"]
[13106,"DRENAJE DE ESPACIO SUBDURAL, POR DERIVACION SUBDURO PERITONEAL ",210]
[22101,"DERIVACION DE VENTRICULO A CISTERNA MAGNA ",210]
[22202,"DERIVACION VENTRICULAR A ESPACIO SUBARACNOIDEO CERVICAL [TORKILSEN] ",210]
[22300,"COLOCACION DE CATETER VENTRICULO PERITONEAL, SIN VALVULA SOD ",210]
[23201,"DERIVACION VENTRICULOATRIAL ",210]
[23401,"VENTRICULOPERITONEOSTOMIA ",210]
[23402,"DERIVACION CISTO PERITONEAL [QUISTE VENTRICULAR A PERITONEO] ",210]
[23500,"DERIVACION VENTRICULAR AL APARATO URINARIO SOD ",210]
[549003,"COLOCACION DE CATETERES PARA DERIVACION VENTRICULOPERITONEAL Y PERITONEOVENTRICULAR ",210]
[13105,"DRENAJE DE ESPACIO SUBARACNOIDEO,  POR  DERIVACION CISTO PERITONEAL ",210]
[24100,"IRRIGACION DE DERIVACION VENTRICULAR SOD ",120]
[24201,"REEMPLAZO PARCIAL DE DERIVACION ",120]
[24202,"REEMPLAZO TOTAL DE DERIVACION ",140]
[24300,"RETIRO DE DERIVACION SOD ",125]
[37100,"DERIVACION SIRINGO PERITONEAL ESPINAL SOD ",190]
[37200,"DERIVACION SIRINGO SUBDURAL ESPINAL SOD ",190]
[37300,"DERIVACION LUMBO PERITONEAL SOD ",190]
[37400,"DERIVACION LUMBAR EXTERNA SOD ",190]
[37500,"DERIVACION SIRINGO PLEURAL ESPINAL SOD ",190]
[22201,"COLOCACION DE CATETER VENTRICULAR AL EXTERIOR ",150]
[28302,"COLOCACION EPIDURAL DEL ELECTRODO DE NEUROESTIMULACION INTRACRANEAL ",290]
[28304,"IMPLANTACION DE RECEPTOR ELECTROENCEFALOGRAFICO POR TREPANACION ",290]
[28303,"IMPLANTACION PARENQUIMATOSA DEL ELECTRODO DE NEUROESTIMULACION INTRACRANEAL ",230]
[19100,"LOBECTOMIA POR CRANEOTOMIA SOD ",375]
[19200,"LOBECTOMIA POR CRANIECTOMIA SOD ",375]
[18101,"HEMISFERECTOMIA CEREBRAL POR CRANEOTOMIA ",610]
[18201,"HEMISFERECTOMIA CEREBELOSA POR CRANEOTOMIA SUBOCCIPITAL ",610]
[44101,"DESCOMPRESION NEUROVASCULAR DE NERVIO TRIGEMINAL, POR CRANEOTOMIA SUBOCCIPITAL ",355]
[44203,"DESCOMPRESION NEUROVASCULAR DE NERVIOS IX Y X ",355]
[44204,"DESCOMPRESION NEUROVASCULAR DE NERVIO ACUSTICO VESTIBULAR ",355]
[44205,"DESCOMPRESION  INTRACANALICULAR DE NERVIO FACIAL ",355]
[44206,"DESCOMPRESION NEUROVASCULAR DE NERVIO FACIAL , POR CRANEOTOMIA SUBOCCIPITAL ",355]
[44207,"DESCOMPRESION DE NERVIO FACIAL INTRATEMPORAL VIA TRANSLABERINTICA ",355]
[44208,"DESCOMPRESION DE NERVIO FACIAL INTRATEMPORAL VIA TRANSMASTOIDEA ",355]
[13202,"SECCION DE TEJIDO CEREBRAL (TRACTOS CEREBRALES) , POR CRANEOTOMIA    (132) ",335]
[11304,"BIOPSIA ESTEREOTAXICA DE CEREBRO    (131) ",250]
[17002,"DRENAJE DE COLECCIONES INTRACEREBRALES , GUIADO POR ESTEREOTAXIA     (2) ",250]
[17005,"DRENAJE DE COLECCIONES INTRACEREBRALES DE FOSA POSTERIOR , GUIADO POR ESTEREOTAXIA    (2) ",250]
[13201,"SECCION DE TEJIDO CEREBRAL (TRACTOS CEREBRALES) POR ABLACION [TERMOLESION] ESTEREOTAXICA ",420]
{"$rows_left_out":982}
{"sheet":"Hoja2","index":1,"n_rows":4,"n_cols":2,"rows_kept":4,"cut":false,"hidden":false,"merged":[]}
["CODIGO",15102]
["PROCEDIMIENTOS",{"$f":"VLOOKUP(B1,ISS,2,FALSE)","v":"RESECCION TUMOR OSEO, POR CRANIECTOMIA "}]
["UVR",100]
["DERECHO DE SALA",{"$f":"IF(B3>450,1410*B3,VLOOKUP(B3,SALAS,2,TRUE))","v":144645}]

{"sheet":"TABLA","index":2,"n_rows":39,"n_cols":2,"rows_kept":39,"cut":false,"hidden":false,"merged":[[24,0,24,1]]}
["HASTA UVR","VALOR"]
[20,1280]
[30,26790]
[40,44270]
[50,55605]
[60,81176]
[70,96520]
[80,114830]
[90,129655]
[100,144645]
[110,148545]
[130,153075]
[150,186410]
[170,204700]
[200,246970]
[230,279405]
[260,318255]
[290,356455]
[320,401105]
[350,445560]
[380,471015]
[410,503460]
[450,548020]
[]
["MATERIALES"]
["Hasta UVR","Valor"]
[20,31000]
[30,32005]
[40,33110]
[50,45305]
[60,57410]
[70,82315]
[80,88610]
[90,95015]
[100,109205]
[110,123310]
[130,131115]
[150,140120]
[170,152910]

{"sheet":"INFORMACION ","index":3,"n_rows":16,"n_cols":6,"rows_kept":16,"cut":false,"hidden":false,"merged":[[1,0,4,0],[0,0,0,2],[5,0,8,0],[9,0,11,0],[12,0,14,0]]}
["INFORMACION PROCEDIMIENTO QUIRURGICOS "]
["INFORMACIN GENERAL","Documento Nº "]
[null,"Fecha"]
[null,"Sala Nº ",null,null,null,{"$f":"E4*'INFORMACION '!C163","v":0}]
[null,"Tiempo Empleado"]
["CARACTERISTICAS ","No de Cirugias",2]
[null,"No de Vias",2]
[null,"No de Cirujanos",2]
[null,"Bilateral","NO"]
["PRIMERA CIRUGIA ","CUPS",28500]
[null,"DETALLE",{"$f":"VLOOKUP(C10,ISS,2,FALSE)","v":"EXTRACCIÓN DE TRACTOR CEFALICO [HALO CHALECO] SOD "}]
[null,"UVR",{"$f":"VLOOKUP(C10,ISS,3,FALSE)","v":35}]
["SEGUNDA CIRUGIA ","CUPS",373301]
[null,"DETALLE",{"$f":"IF(C6=1,\"SOLO TIENE REGISTRADA UNA(1) CX\",VLOOKUP(C13,ISS,2,FALSE))","v":"ESCISION DE TUMOR DEL CORAZON   (75) "}]
[null,"UVR",{"$f":"IF(C12<VLOOKUP(C13,ISS,3,FALSE),\"LA PRIMERA CX ES DE MENOR VALOR, CORREGIR EL ORDEN\",VLOOKUP(C13,ISS,3,FALSE))","v":"LA PRIMERA CX ES DE MENOR VALOR, CORREGIR EL ORDEN"}]
["RECARGO","ISS-2001+",0.35]

{"sheet":"HONORARIOS ","index":4,"n_rows":18,"n_cols":8,"rows_kept":18,"cut":false,"hidden":false,"merged":[[9,7,9,8],[0,0,0,7],[1,0,1,7],[3,7,3,8],[4,7,4,8],[7,7,7,8]]}
["HONORARIOS PROFESIONALES"]
["HONORARIOS CIRUJANO"]
["CODIGO","PROCEDIMIENTO","UVR","VALOR PLENO","# vias","#CIRUJANO","%","VALOR  FACTURADO"]
[{"$f":"[1]INFORMACION!C10","v":16201},{"$f":"VLOOKUP(A4,ISS,2,FALSE)","v":"RESECCION TUMOR DE LA HOZ , POR CRANEOTOMIA Y PLASTIA "},{"$f":"VLOOKUP(A4,ISS,3,FALSE)","v":305},{"$f":"C4*G15","v":387350},{"$f":"[1]INFORMACION!C6","v":1},{"$f":"[1]INFORMACION!C8","v":1},1,{"$f":"(D4*G4)*(100%+[1]INFORMACION!C16)","v":522922.50000000006}]
[11302,{"$f":"IF(A5=\"\",\"\",VLOOKUP(A5,ISS,2,FALSE))","v":"BIOPSIA ABIERTA ( CRANEOTOMIA) DE CEREBRO "},{"$f":"IF(A5=\"\",0,VLOOKUP(A5,ISS,3,FALSE))","v":210},"%",266700,null,{"$f":"IF([1]INFORMACION!C9=\"SI\",75%,VLOOKUP(CONCATENATE([1]INFORMACION!C6,[1]INFORMACION!C7),CIRUGIA2,2,FALSE))","v":0.75},{"$f":"(E5*G5)*(100%+[1]INFORMACION!C16)","v":270033.75}]
[null,"HONORARIOS ANESTESISTA"]
["CODIGO","PROCEDIMIENTO","UVR","VALOR PLENO","# vias","#CIRUJANO","%","VALOR  FACTURADO"]
[null,null,{"$f":"VLOOKUP(A4,ISS,3,FALSE)","v":305},{"$f":"C4*G16","v":292800},null,null,1,{"$f":"(D8*G8)*(100%+[1]INFORMACION!C16)","v":395280}]
["CODIGO","PROCEDIMIENTO","UVR","VALOR PLENO","# vias","#CIRUJANO","%","VALOR  FACTURADO"]
[null,null,{"$f":"VLOOKUP(A4,ISS,3,FALSE)","v":305},{"$f":"C4*G17","v":109800},null,null,1,{"$f":"(D10*G10)*(100%+[1]INFORMACION!C16)","v":148230}]
[]
[]
[]
[null,null,null,null,null,"UVR","VALOR"]
[null,null,null,null,null,"CIRUJANO",1270]
[null,null,null,null,null,"ANEST",960]
[null,null,null,null,null,"AYUDANTE",360]
["CODIGO","PROCEDIMIENTO","UVR","VALOR PLENO","# vias","#CIRUJANO","%","VALOR  FACTURADO"]

{"sheet":"DERECHO DE SALA ","index":5,"n_rows":5,"n_cols":6,"rows_kept":5,"cut":false,"hidden":false,"merged":[[0,0,0,6],[3,5,3,6],[4,5,4,6]]}
["DERCHO DE SALA "]
[]
["CODIGO","DETALLE","UVR","BILATERAL ","Vr BASE","VALOR DERECHO DE SALA "]
[383501,{"$f":"VLOOKUP(A4,ISS,2,FALSE)","v":"RESECCION CON ANASTOMOSIS EN VASOS ESPINALES, SEGMENTO CERVICAL (77) "},{"$f":"VLOOKUP(A4,ISS,3,FALSE)","v":585},null,{"$f":"IF(C4>=450,C4*1410,VLOOKUP(C4,SALA,2,TRUE))","v":824850},{"$f":"E4*'INFORMACION '!C16+E4","v":1113547.5}]
[373301,{"$f":"IFERROR(VLOOKUP(A5,ISS,2,FALSE),\"\")","v":"ESCISION DE TUMOR DEL CORAZON   (75) "},{"$f":"IFERROR(VLOOKUP(A5,ISS,3,FALSE),\"\")","v":400},{"$f":"'INFORMACION '!C9","v":"NO"},{"$f":"IF(C5<=450,C5*1410,VLOOKUP(C5,SALA,2,TRUE))","v":564000},{"$f":"IF(D5=\"SI\",(E5*75%)*(100%+'INFORMACION '!C16),(E5*50%)*(100%+'INFORMACION '!C16))","v":380700}]

{"sheet":"INSUMOS MEDICOS","index":6,"n_rows":272,"n_cols":8,"rows_kept":272,"cut":false,"hidden":false,"merged":[]}
["ss","id","URL","ID Producto","Tipo Producto","Nombre Producto","idTipoProducto","VALOR"]
["http://www.mercadopublico.cl/TiendaFicha/Ficha?idProducto=",1266128,{"$f":"CONCATENATE(A2,B2)","v":"http://www.mercadopublico.cl/TiendaFicha/Ficha?idProducto=1266128"},{"$f":"HYPERLINK(C2,B2)","v":1266128},"ALARGADOR ARTERIAL","ALARGADOR ARTERIAL 3M MEDIVEINS ALPHA-MEDIKIT 25 UNIDADES",6844,15000]
["http://www.mercadopublico.cl/TiendaFicha/Ficha?idProducto=",1266131,"http://www.mercadopublico.cl/TiendaFicha/Ficha?idProducto=1266131",1266131,"ALARGADOR VENOSO","ALARGADOR VENOSO 3M 50 CM M/H MEDIVEINS-MEDIKIT 25 UNIDADES",6845,{"$f":" H2+5000","v":20000}]
["http://www.mercadopublico.cl/TiendaFicha/Ficha?idProducto=",1266186,"http://www.mercadopublico.cl/TiendaFicha/Ficha?idProducto=1266186",1266186,"APÓSITO","APÓSITO TEGADERM FILM 1627 TRANSPARENTE 10 X 25 CM 20 UNIDADES",6860,{"$f":" H3+5000","v":25000}]
["http://www.mercadopublico.cl/TiendaFicha/Ficha?idProducto=",1266197,"http://www.mercadopublico.cl/TiendaFicha/Ficha?idProducto=1266197",1266197,"APÓSITO","APÓSITO TEGADERM + PAD 3582 TRANSPARENTE CON GASA NO ADHERENTE 5 X 7 CM 50 UNIDADES",6860,30000]
["http://www.mercadopublico.cl/TiendaFicha/Ficha?idProducto=",1266196,"http://www.mercadopublico.cl/TiendaFicha/Ficha?idProducto=1266196",1266196,"APÓSITO","APÓSITO 3M TRANSPARENTE CON GASA NO ADHERENTE TEGADERM + PAD 3593 10 X 35 CM 25 UNIDADES",6860,35000]
["http://www.mercadopublico.cl/TiendaFicha/Ficha?idProducto=",1266155,"http://www.mercadopublico.cl/TiendaFicha/Ficha?idProducto=1266155",1266155,"APÓSITO","APÓSITO 3M CAVILON PELICULA PROTECTORA SIN ARDOR 3355 12 UNIDADES",6860,40000]
["http://www.mercadopublico.cl/TiendaFicha/Ficha?idProducto=",1266193,"http://www.mercadopublico.cl/TiendaFicha/Ficha?idProducto=1266193",1266193,"APÓSITO","APÓSITO 3M TRANSPARENTE ADHESIVO TEGADERM 9534HP 6 X 7 CM 100 UNIDADES",6860,45000]
["http://www.mercadopublico.cl/TiendaFicha/Ficha?idProducto=",1266166,"http://www.mercadopublico.cl/TiendaFicha/Ficha?idProducto=1266166",1266166,"APÓSITO","APÓSITO 3M HIDROGEL TUBO 15 GR TEGADERM 91110 10 UNIDADES",6860,50000]
["http://www.mercadopublico.cl/TiendaFicha/Ficha?idProducto=",1266151,"http://www.mercadopublico.cl/TiendaFicha/Ficha?idProducto=1266151",1266151,"APÓSITO","APÓSITO 3M ALGINATO DE CALCIO EN PLACA TEGADERM 90112 10 X 10 CM 10 UNIDADES ",6860,55000]
["http://www.mercadopublico.cl/TiendaFicha/Ficha?idProducto=",1266161,"http://www.mercadopublico.cl/TiendaFicha/Ficha?idProducto=1266161",1266161,"APÓSITO","APÓSITO 3M HIDROCOLOIDE OVALADO TEGADERM STANDARD 90001 7 X 9 CM 5 UNIDADES",6860,60000]
["http://www.mercadopublico.cl/TiendaFicha/Ficha?idProducto=",1266164,"http://www.mercadopublico.cl/TiendaFicha/Ficha?idProducto=1266164",1266164,"APÓSITO","APÓSITO 3M HIDROCOLOIDE THIN OVALADO TEGADERM 90023 10 X 12 CM 10 UNIDADES",6860,65000]
["http://www.mercadopublico.cl/TiendaFicha/Ficha?idProducto=",1266169,"http://www.mercadopublico.cl/TiendaFicha/Ficha?idProducto=1266169",1266169,"APÓSITO","APÓSITO 3M CAVILON PELICULA PROTECTORA SIN ARDOR SPRAY 28 ML 12 UNIDADES",6860,70000]
["http://www.mercadopublico.cl/TiendaFicha/Ficha?idProducto=",1266202,"http://www.mercadopublico.cl/TiendaFicha/Ficha?idProducto=1266202",1266202,"APÓSITO","APÓSITO 3M TRANSPARENTE CON GASA NO ADHERENTE TEGADERM + PAD 3589 9 X 15 CM 25 UNIDADES",6860,75000]
["http://www.mercadopublico.cl/TiendaFicha/Ficha?idProducto=",1266160,"http://www.mercadopublico.cl/TiendaFicha/Ficha?idProducto=1266160",1266160,"APÓSITO","APÓSITO 3M HIDROCOLOIDE OVALADO TEGADERM STANDARD 90004 14 X 17 CM 3 UNIDADES",6860,80000]
["http://www.mercadopublico.cl/TiendaFicha/Ficha?idProducto=",1266184,"http://www.mercadopublico.cl/TiendaFicha/Ficha?idProducto=1266184",1266184,"APÓSITO","APÓSITO 3M TRANSPARENTE ADHESIVO TEGADERM 1626W 10 X 12 CM 50 UNIDADES",6860,85000]
["http://www.mercadopublico.cl/TiendaFicha/Ficha?idProducto=",1266203,"http://www.mercadopublico.cl/TiendaFicha/Ficha?idProducto=1266203",1266203,"APÓSITO","APÓSITO 3M TRANSPARENTE CON GASA NO ADHERENTE TEGADERM + PAD 3591 9 X 25 CM 25 UNIDADES",6860,90000]
["http://www.mercadopublico.cl/TiendaFicha/Ficha?idProducto=",1266156,"http://www.mercadopublico.cl/TiendaFicha/Ficha?idProducto=1266156",1266156,"APÓSITO","APÓSITO 3M ESPUMA HIDROFÍLICA SIN ADHESIVO TEGADERM FOAM 90601 10 X 10 CM 10 UNIDADES",6860,95000]
["http://www.mercadopublico.cl/TiendaFicha/Ficha?idProducto=",1266192,"http://www.mercadopublico.cl/TiendaFicha/Ficha?idProducto=1266192",1266192,"APÓSITO","APÓSITO 3M TRANSPARENTE ADHESIVO TEGADERM 1624W 6 X 7 CM 100 UNIDADES",6860,100000]
["http://www.mercadopublico.cl/TiendaFicha/Ficha?idProducto=",1266165,"http://www.mercadopublico.cl/TiendaFicha/Ficha?idProducto=1266165",1266165,"APÓSITO","APÓSITO 3M HIDROCOLOIDE THIN OVALADO TEGADERM 90021 7 X 9 CM 10 UNIDADES",6860,105000]
["http://www.mercadopublico.cl/TiendaFicha/Ficha?idProducto=",1266179,"http://www.mercadopublico.cl/TiendaFicha/Ficha?idProducto=1266179",1266179,"APÓSITO","APÓSITO 3M TELA SUAVE CON GASA NO ADHERENTE MEDIPORE + PAD 3562 5 X 7 CM 50 UNIDADES",6860,110000]
["http://www.mercadopublico.cl/TiendaFicha/Ficha?idProducto=",1266195,"http://www.mercadopublico.cl/TiendaFicha/Ficha?idProducto=1266195",1266195,"APÓSITO","APÓSITO 3M TRANSPARENTE ADHESIVO TEGADERM I.V. 1655 8,5 X 11,5 CM 50 UNIDADES",6860,115000]
["http://www.mercadopublico.cl/TiendaFicha/Ficha?idProducto=",1266194,"http://www.mercadopublico.cl/TiendaFicha/Ficha?idProducto=1266194",1266194,"APÓSITO","APÓSITO 3M TRANSPARENTE ADHESIVO TEGADERM I.V. 1633 7 X 8,5 CM 100 UNIDADES",6860,120000]
["http://www.mercadopublico.cl/TiendaFicha/Ficha?idProducto=",1266191,"http://www.mercadopublico.cl/TiendaFicha/Ficha?idProducto=1266191",1266191,"APÓSITO","APÓSITO 3M TRANSPARENTE ADHESIVO TEGADERM I.V. 1610 5 X 5,7 CM 100 UNIDADES",6860,125000]
["http://www.mercadopublico.cl/TiendaFicha/Ficha?idProducto=",1266172,"http://www.mercadopublico.cl/TiendaFicha/Ficha?idProducto=1266172",1266172,"APÓSITO","APÓSITO 3M TEGADERM FOAM 10 X 20 CM 5 UNIDADES",6860,130000]
["http://www.mercadopublico.cl/TiendaFicha/Ficha?idProducto=",1339629,"http://www.mercadopublico.cl/TiendaFicha/Ficha?idProducto=1339629",1339629,"APÓSITO","APÓSITO 3M TEGADERM I.V. ADVANCED 1680 PEDIATRICO PEQUEÑO 3,8 X 4,5 CM 400 UNIDADES",6860,135000]
["http://www.mercadopublico.cl/TiendaFicha/Ficha?idProducto=",1266152,"http://www.mercadopublico.cl/TiendaFicha/Ficha?idProducto=1266152",1266152,"APÓSITO","APÓSITO 3M ANTIMICROBIANO CON PLATA TEGADERM AG MESH 90500 5 X 5 CM 5 UNIDADES",6860,140000]
["http://www.mercadopublico.cl/TiendaFicha/Ficha?idProducto=",1266190,"http://www.mercadopublico.cl/TiendaFicha/Ficha?idProducto=1266190",1266190,"APÓSITO","APÓSITO 3M TRANSPARENTE ADHESIVO TEGADERM 1622W 4,4 X 4,4 CM 100 UNIDADES",6860,145000]
["http://www.mercadopublico.cl/TiendaFicha/Ficha?idProducto=",1266153,"http://www.mercadopublico.cl/TiendaFicha/Ficha?idProducto=1266153",1266153,"APÓSITO","APÓSITO 3M ANTIMICROBIANO CON PLATA TEGADERM AG MESH 90501 10 X 12,7 CM 5 UNIDADES",6860,150000]
["http://www.mercadopublico.cl/TiendaFicha/Ficha?idProducto=",1266200,"http://www.mercadopublico.cl/TiendaFicha/Ficha?idProducto=1266200",1266200,"APÓSITO","APÓSITO 3M TRANSPARENTE CON GASA NO ADHERENTE TEGADERM + PAD 3587 9 X 10,5 CM 25 UNIDADES",6860,155000]
["http://www.mercadopublico.cl/TiendaFicha/Ficha?idProducto=",1266158,"http://www.mercadopublico.cl/TiendaFicha/Ficha?idProducto=1266158",1266158,"APÓSITO","APÓSITO 3M HIDROCOLOIDE CUADRADO STANDARD 90002 10 X 10 CM 5 UNIDADES",6860,160000]
["http://www.mercadopublico.cl/TiendaFicha/Ficha?idProducto=",1266150,"http://www.mercadopublico.cl/TiendaFicha/Ficha?idProducto=1266150",1266150,"APÓSITO","APÓSITO 3M ALGINATO DE CALCIO EN MECHA TEGADERM 90120 30,4 CM 5 UNIDADES",6860,165000]
["http://www.mercadopublico.cl/TiendaFicha/Ficha?idProducto=",1266175,"http://www.mercadopublico.cl/TiendaFicha/Ficha?idProducto=1266175",1266175,"APÓSITO","APÓSITO 3M TEGADERM I.V. CHG CATETERES CENTRALES 8,5 X 11,5 CM 25 UNIDADES",6860,170000]
["http://www.mercadopublico.cl/TiendaFicha/Ficha?idProducto=",1266176,"http://www.mercadopublico.cl/TiendaFicha/Ficha?idProducto=1266176",1266176,"APÓSITO","APÓSITO 3M TEGADERM I.V. CHG CATETERES PERIFERICOS 7 X 8,5 CM 25 UNIDADES",6860,175000]
["http://www.mercadopublico.cl/TiendaFicha/Ficha?idProducto=",1266148,"http://www.mercadopublico.cl/TiendaFicha/Ficha?idProducto=1266148",1266148,"APÓSITO","APÓSITO 3M ALGINATO AG TEGADERM 10 X 12,7 CM 10 UNIDADES",6860,180000]
["http://www.mercadopublico.cl/TiendaFicha/Ficha?idProducto=",1266149,"http://www.mercadopublico.cl/TiendaFicha/Ficha?idProducto=1266149",1266149,"APÓSITO","APÓSITO 3M ALGINATO AG TEGADERM 5 X 5 CM 10 UNIDADES",6860,185000]
["http://www.mercadopublico.cl/TiendaFicha/Ficha?idProducto=",1266170,"http://www.mercadopublico.cl/TiendaFicha/Ficha?idProducto=1266170",1266170,"APÓSITO","APÓSITO 3M RESTON CONFORMABLE 16 X 20 CM 2 UNIDADES",6860,190000]
["http://www.mercadopublico.cl/TiendaFicha/Ficha?idProducto=",1266183,"http://www.mercadopublico.cl/TiendaFicha/Ficha?idProducto=1266183",1266183,"APÓSITO","APÓSITO 3M TELA SUAVE CON GASA NO ADHERENTE MEDIPORE + PAD 3570 9 X 20 CM 25 UNIDADES",6860,195000]
["http://www.mercadopublico.cl/TiendaFicha/Ficha?idProducto=",1339630,"http://www.mercadopublico.cl/TiendaFicha/Ficha?idProducto=1339630",1339630,"APÓSITO","APÓSITO 3M TEGADERM I.V. ADVANCED 1682 PEDIATRICO GRANDE 5 X 5,7 CM 400 UNIDADES",6860,200000]
["http://www.mercadopublico.cl/TiendaFicha/Ficha?idProducto=",1266159,"http://www.mercadopublico.cl/TiendaFicha/Ficha?idProducto=1266159",1266159,"APÓSITO","APÓSITO 3M HIDROCOLOIDE OVALADO TEGADERM STANDARD 90003 10 X 12 CM 5 UNIDADES",6860,205000]
{"$rows_left_out":233}
{"sheet":"MATERIALES","index":7,"n_rows":18,"n_cols":11,"rows_kept":18,"cut":false,"hidden":false,"merged":[[17,3,17,4],[0,0,0,4],[0,6,0,10],[13,2,13,3],[13,8,13,9],[16,3,16,4]]}
["MATERIALES DE SUTURA Y CURACION - CONSUMO 1a Cirugia ",null,null,null,null,null,"MATERIALES DE SUTURA Y CURACION - CONSUMO 1a Cirugia "]
["CODIGO","DETALLE","CANTIDAD","VR UNIT","VR TOTAL",null,"CODIGO","DETALLE","CANTIDAD","VR UNIT","VR TOTAL"]
[1266151,{"$f":"VLOOKUP(A3,INSUMOS,3,FALSE)","v":"APÓSITO 3M ALGINATO DE CALCIO EN PLACA TEGADERM 90112 10 X 10 CM 10 UNIDADES "},0.5,55000,{"$f":"D3*C3","v":27500},null,1266164,{"$f":"VLOOKUP(G3,INSUMOS,3,FALSE)","v":"APÓSITO 3M HIDROCOLOIDE THIN OVALADO TEGADERM 90023 10 X 12 CM 10 UNIDADES"},0.5,75000,{"$f":"J3*I3","v":37500}]
[1266482,{"$f":"IF(A4=\"\",\"\",VLOOKUP(A4,INSUMOS,3,FALSE))","v":"ELECTRODO 3M MONITORIZACIÓN RED DOT CON BROCHE DE CARBONO 5 UNIDADES"},0.2,640000,{"$f":"D4*C4","v":128000},null,1266161,{"$f":"IF(G4=\"\",\"\",VLOOKUP(G4,INSUMOS,3,FALSE))","v":"APÓSITO 3M HIDROCOLOIDE OVALADO TEGADERM STANDARD 90001 7 X 9 CM 5 UNIDADES"},1,50000,{"$f":"J4*I4","v":50000}]
[1266482,"ELECTRODO 3M MONITORIZACIÓN RED DOT CON BROCHE DE CARBONO 5 UNIDADES",null,null,0,null,null,"",null,null,{"$f":"J5*I5","v":0}]
[null,"",null,null,0,null,null,"",null,{"$f":"IF(G6=0,0,VLOOKUP(G6,INSUMOS,5,FALSE))","v":0},0]
[null,"",null,null,0,null,null,"",null,0,0]
[null,"",null,null,0,null,null,"",null,0,0]
[null,"",null,null,0,null,null,"",null,0,0]
[null,"",null,null,0,null,null,"",null,0,0]
[null,"",null,null,0,null,null,"",null,0,0]
[null,"",null,null,0,null,null,"",null,0,0]
[null,"",null,null,0,null,null,"",null,0,0]
[null,null,"TOTAL PRIMERA CIRUGIA ",null,{"$f":"SUM(E3:E13)","v":155500},null,null,null,"TOTAL SEGUNDA CIRUGIA ",null,{"$f":"SUM(K3:K13)","v":87500}]
[]
["CODIGO","PROCEDIMIENTO ","UVR","VR. MATERIALES",null,"DETALLE "]
[{"$f":"'INFORMACION '!C10","v":28500},{"$f":"VLOOKUP(A17,ISS,2,FALSE)","v":"EXTRACCIÓN DE TRACTOR CEFALICO [HALO CHALECO] SOD "},{"$f":"VLOOKUP(A17,ISS,3,FALSE)","v":35},{"$f":"IF(C17>=170,E14,VLOOKUP(C17,MATERIALES,2,TRUE))","v":32005},null,{"$f":"CONCATENATE(\"Materiales \",B17)","v":"Materiales EXTRACCIÓN DE TRACTOR CEFALICO [HALO CHALECO] SOD "}]
[{"$f":"'INFORMACION '!C13","v":373301},{"$f":"IF(A18=\"\",\"\",VLOOKUP(A18,ISS,2,FALSE))","v":"ESCISION DE TUMOR DEL CORAZON   (75) "},{"$f":"IF(A18=\"\",\"\",VLOOKUP(A18,ISS,3,FALSE))","v":400},{"$f":"IF(C18>=170,K14,VLOOKUP(C18,MATERIALES,2,TRUE))","v":87500},null,{"$f":"CONCATENATE(\"Materiales \",B18)","v":"Materiales ESCISION DE TUMOR DEL CORAZON   (75) "}]

{"sheet":"Facturacion ","index":8,"n_rows":18,"n_cols":5,"rows_kept":18,"cut":false,"hidden":false,"merged":[[8,0,8,5],[2,0,2,5],[7,0,7,5],[6,2,6,5],[0,0,0,5],[1,0,1,2],[3,1,3,3],[4,0,4,1],[6,0,6,1],[9,0,9,1],[11,0,11,1],[12,0,12,1],[13,0,13,1],[10,0,10,1],[15,0,15,1],[14,0,14,5],[17,0,19,1],[17,2,19,3],[17,4,19,5],[16,0,16,5],[15,4,15,5],[9,4,9,5],[10,4,10,5],[11,4,11,5],[12,4,12,5],[13,4,13,5]]}
["CLINICA LA PELIGROSA - NIT 819.000.001"]
["FACTURA DE SERVICIO Nº",null,null,null,"Fecha:"]
[]
["Cliente:",null,null,null,"RUT:"]
["Direccion",null,"Telefono:",null,"Contacto:"]
["Paciente:",null,"Identificacion:",null,"Autorizacion:"]
["PROCEDIMIENTO REALIZADOS",null,"EXTRACCIÓN DE TRACTOR CEFALICO [HALO CHALECO] SOD "]
[]
["LIQUIDACION DE SERVICIOS"]
["Derecho de Sala "]
["Honorarios Cirujanos"]
["Honorarioan Anestesiologo"]
["Honorarios Ayudantes"]
["Materiales"]
[]
["TOTAL FACTURADO",null,null,null,{"$f":"SUM(E10:F14)","v":0}]
[]
["Firmado Recibido",null,"Firma Paciente ",null,"Autorizado"]

{"sheet":"Facturacion Multiple","index":9,"n_rows":25,"n_cols":5,"rows_kept":25,"cut":false,"hidden":false,"merged":[[7,0,7,1],[6,0,6,1],[7,2,7,5],[6,2,6,5],[0,0,0,5],[1,0,1,2],[2,0,2,5],[3,1,3,3],[4,0,4,1],[23,0,23,5],[24,0,26,1],[24,2,26,3],[24,4,26,5],[8,0,8,5],[9,0,9,5],[10,0,10,1],[11,0,11,1],[13,0,13,1],[16,0,16,1],[12,0,12,1],[14,0,14,1],[15,0,15,1],[16,4,16,5],[22,4,22,5],[10,4,10,5],[11,4,11,5],[12,4,12,5],[13,4,13,5],[14,4,14,5],[15,4,15,5],[21,0,21,5],[22,0,22,1],[17,4,17,5],[18,4,18,5],[19,4,19,5],[20,4,20,5],[17,0,17,1],[18,0,18,1],[19,0,19,1],[20,0,20,1]]}
["CLINICA LA PELIGROSA - NIT 819.000.001"]
["FACTURA DE SERVICIO Nº",null,null,null,"Fecha:"]
[]
["Cliente:",null,null,null,"RUT:"]
["Direccion",null,"Telefono:",null,"Contacto:"]
["Paciente:",null,"Identificacion:",null,"Autorizacion:"]
["CIRUGIA No 1"]
["CIRUGIA No 2"]
[]
["LIQUIDACION DE SERVICIOS"]
["Derecho de Sala Primera Cirugia "]
["Derecho de Sala Segunda Cirugia "]
["Honorarios Cirujano Principal"]
["Honorarios Segunda Cirugia"]
["Honorario Anestesia Primera Cirugia"]
["Honorario Anestesia Segunda Cirugia"]
["Honorarios Ayudantes Primera Cirugia"]
["Honorarios AyudantesSegunda Cirugia"]
["Materiales Primera Cirugia"]
["Materiales Segunda Cirugia"]
["Sala",null,null,null,{"$f":"SUM(E11:F20)","v":0}]
[]
["TOTAL FACTURADO"]
[]
["Firmado Recibido",null,"Firma Paciente ",null,"Autorizado"]

{"sheet":"Hoja1","index":10,"n_rows":2,"n_cols":10,"rows_kept":2,"cut":false,"hidden":false,"merged":[]}
[2,2,2,"NO",352200,{"$f":"VLOOKUP(E1,ISS,2,FALSE)","v":"REEMPLAZO DE VALVULA MITRAL CON PROTESIS O BIOPROTESIS (AUTOLOGA O HETEROLOGA) SOD "},{"$f":"VLOOKUP(E1,ISS,3,FALSE)","v":450},373301,{"$f":"IF(A1=1,\"SOLO TIENE REGISTRADA UNA(1) CX\",VLOOKUP(H1,ISS,2,FALSE))","v":"ESCISION DE TUMOR DEL CORAZON   (75) "},{"$f":"IF(G1<VLOOKUP(H1,ISS,3,FALSE),\"LA PRIMERA CX ES DE MENOR VALOR, CORREGIR EL ORDEN\",VLOOKUP(H1,ISS,3,FALSE))","v":400}]
[1,2,1,"SI",33100,{"$f":"VLOOKUP(E2,ISS,2,FALSE)","v":"PUNCION LUMBAR SOD * "},{"$f":"VLOOKUP(E2,ISS,3,FALSE)","v":40},39001,{"$f":"IF(A2=1,\"SOLO TIENE REGISTRADA UNA(1) CX\",VLOOKUP(H2,ISS,2,FALSE))","v":"SOLO TIENE REGISTRADA UNA(1) CX"},{"$f":"IF(G2<VLOOKUP(H2,ISS,3,FALSE),\"LA PRIMERA CX ES DE MENOR VALOR, CORREGIR EL ORDEN\",VLOOKUP(H2,ISS,3,FALSE))","v":"LA PRIMERA CX ES DE MENOR VALOR, CORREGIR EL ORDEN"}]

{"sheet":"Hoja4","index":11,"n_rows":0,"n_cols":0,"rows_kept":0,"cut":false,"hidden":false,"merged":[]}

{"sheet":"Hoja3","index":12,"n_rows":3,"n_cols":6,"rows_kept":3,"cut":false,"hidden":false,"merged":[]}
["CODIGO","DETALLE","UVR","BILATERAL"]
[383501,"RESECCION CON ANASTOMOSIS EN VASOS ESPINALES, SEGMENTO CERVICAL (77) ",585,null,824850,1113547.5]
[373301,"ESCISION DE TUMOR DEL CORAZON   (75) ",400,"NO"]